{"text_format":"1","workbook":"xlsx","n_sheets":22,"sheets":["Using the Model ","Interface","Built-In Assumptions","Validation","Production Assumptions","TEMPERATURE","System Footprint","Production Cycle","HR","CAPEX","OPEX - Pond","Working Capital - Pond","IS - Pond","BS - Pond","CF - Pond","IRR - Pond","NPV & PI - Pond","DEP - Pond","Loan - Pond","Loan Int & Bal - Pond","BREAK-EVEN GRAPH","RISK"],"not_rendered":{"charts":1,"images":21,"macros":1,"external_links":1,"defined_names":2,"comments":0,"pivot_tables":0},"unopened":[],"bounds":{"document_bytes":16777216,"sheet_cells":100000,"rows_first":2000,"rows_last":500,"rows_between":2000,"halvings":0,"cell_chars":16384,"cell_head_chars":4096},"cells_cut":0,"cells_raw":0,"read":"whole","date_system":"1900"}

{"sheet":"Using the Model ","index":0,"n_rows":74,"n_cols":3,"rows_kept":74,"cut":false,"hidden":false,"merged":[]}
[]
[]
[]
[]
[]
[]
{"$rows_left_out":69}
{"sheet":"Interface","index":1,"n_rows":43,"n_cols":10,"rows_kept":43,"cut":false,"hidden":false,"merged":[[18,6,19,7],[42,5,43,8],[29,4,29,5],[8,8,10,8],[28,4,28,5],[39,8,40,8],[34,5,35,5],[39,5,40,5],[39,6,40,6],[39,7,40,7],[34,6,35,6],[34,7,35,7],[34,8,35,8],[7,6,8,6]]}
[null,"Economic Analysis Model For the R&D aquaculture projects"]
[]
[]
[]
[]
[]
{"$rows_left_out":38}
{"sheet":"Built-In Assumptions","index":2,"n_rows":31,"n_cols":8,"rows_kept":31,"cut":false,"hidden":false,"merged":[[3,3,3,4],[26,3,26,4]]}
[null,"Built-In Assumptions"]
[]
[]
[null,null,null,"GENERAL ASSUMPTIONS"]
[null,null,null,"CPI",5.0999999999999997E-2]
[null,null,null,"Business Tax",0.28000000000000003]
{"$rows_left_out":26}
{"sheet":"Validation","index":3,"n_rows":1002,"n_cols":8,"rows_kept":1002,"cut":false,"hidden":true,"merged":[]}
[null,"Tonnage ",null,"Species",null,"Systems",null,"Markets"]
[null,"<Please Select Tonnage>",null,"<Please Select a Species>",null,"<Please Select a System>",null,"<Please Select a Market>"]
[null,1,null,"Abalone",null," Recirculation Aquaculture System (RAS)",null,"Local Markets"]
[null,2,null,"Catfish",null,"Aquaponics",null,"International Markets"]
[null,3,null,"Freshwater Ornamental",null,"Pond culture"]
[null,4,null,"Marine Ornamental ",null,"Cage Culture"]
{"$rows_left_out":997}
{"sheet":"Production Assumptions","index":4,"n_rows":99,"n_cols":33,"rows_kept":99,"cut":false,"hidden":false,"merged":[[50,1,50,2],[36,1,36,4],[0,0,0,16383]]}
["Aquaculture - Marron Crayfish Production financial analysis"]
[]
[null,"GENERAL ASSUMPTIONS",null,null,"Pond Culture Assumptions"]
[null,"CPI",{"$f":"'Built-In Assumptions'!E5","v":5.0999999999999997E-2},null,"Fertiliser (4,5Kgs)",null,165]
[null,"Number of weeks in a month",4,null,"High quality disinfectant chemicals",null,100]
[null," CPI in percentage",{"$f":"C4+1","v":1.0509999999999999},null,"water treatment chemical 70% chlorine calcium hypochlorite",null,{"$f":"5000/12","v":416.66666666666669}]
{"$rows_left_out":94}
{"sheet":"TEMPERATURE","index":5,"n_rows":46,"n_cols":13,"rows_kept":46,"cut":false,"hidden":true,"merged":[[1,0,1,1],[1,6,1,9],[13,0,13,2],[13,6,13,9],[14,0,15,2]]}
[]
["Temperature Data ( Average Max and Min Temperature per province in SA",null,null,29,null,null,"Electricity"]
["Province","Average Max Temperature (°C)","Average Min Temperature (°C)","AVG","Electricity Cost Ratio",null,"Units No tunnel","Cost no tunnel (R1.09/kWh)","Units Tunnel","Cost tunnel (R1.09/kWh)"]
["Limpopo",24.77,15.99,{"$f":"(B4+C4)/2","v":20.38},{"$f":"I4/$I$12","v":1.1157952367916777},{"$f":"G4/$G$12","v":1.1157952367916777},{"$f":"G5/D5*D4","v":624.84533260333956},{"$f":"G4*1.09","v":681.08141253764018},{"$f":"G4*95%","v":593.60306597317253},{"$f":"I4*1.09","v":647.02734191075808}]
["Gauteng",21.44,10.35,{"$f":"(B5+C5)/2","v":15.895},{"$f":"I5/$I$12","v":0.87024363536819027},null,{"$f":"G6/D6*D5","v":487.33643580618656},{"$f":"G5*1.09","v":531.19671502874337},{"$f":"G5*95%","v":462.9696140158772},{"$f":"I5*1.09","v":504.63687927730621}]
["North West",23.73,11.31,17.52,0.95921160689843943,null,537.15849986312605,{"$f":"G6*1.09","v":585.50276485080747},510.30057486996975,556.22762660826709]
{"$rows_left_out":41}
{"sheet":"System Footprint","index":6,"n_rows":11,"n_cols":6,"rows_kept":11,"cut":false,"hidden":false,"merged":[]}
[]
[null,null,"Pond Space Requirements"]
[null,null,"Infrastructure","Space required m2","% added (space around/ between, for drainage, piping, roads etc as applicable)","Total Space Required"]
[null,null,{"$f":"CAPEX!C15","v":"Grow-out containment number  (m²)"},{"$f":"((CAPEX!D16*CAPEX!D17)*2)*CAPEX!E15","v":{"$error":"#VALUE!"}},1.2,{"$f":"E4*D4","v":{"$error":"#VALUE!"}}]
[null,null,{"$f":"CAPEX!C6","v":"StoreRooms (m²)"},{"$f":"CAPEX!D6","v":25},1.2,{"$f":"E5*D5","v":30}]
[null,null,{"$f":"CAPEX!C7","v":"Offices  (m²)"},{"$f":"CAPEX!D7","v":{"$error":"#VALUE!"}},1.2,{"$error":"#VALUE!"}]
{"$rows_left_out":6}
{"sheet":"Production Cycle","index":7,"n_rows":34,"n_cols":37,"rows_kept":34,"cut":false,"hidden":false,"merged":[[0,0,0,16383],[3,25,3,36],[3,1,3,12],[31,0,33,0],[31,2,31,5],[32,2,32,5],[33,2,33,5]]}
["Aquaculture - Marron Crayfish Production financial analysis"]
["Marron Crayfish",null,null,null,null,null,null,null,null,null,null,null,null,null,{"$f":"(O8-N8)/O8","v":{"$error":"#DIV/0!"}}]
[null,24,23,22,21,20,19,18,17,16,15,14,13,12,11,10,9,8,7,6,5,4,3,2,{"$f":"Y10*Y7","v":{"$error":"#VALUE!"}}]
[null,"Growth rate up to harvest mass",null,null,null,null,null,null,null,null,null,null,null,null,null,null,null,null,null,null,null,null,null,null,null,"Year 3"]
[null,"Month 1","Month 2","Month 3","Month 4","Month 5","Month 6","Month 7","Month 8","Month 9","Month 10","Month 11","Month 12","Month 13","Month 14","Month 15","Month 16","Month 17","Month 18","Month 19","Month 20","Month 21","Month 22","Month 23","Month 24","Month 25","Month 26","Month 27","Month 28","Month 29","Month 30","Month 31","Month 32","Month 33","Month 34","Month 35","Month 36"]
["Stocking (Batch)"]
{"$rows_left_out":29}
{"sheet":"HR","index":8,"n_rows":17,"n_cols":46,"rows_kept":17,"cut":false,"hidden":true,"merged":[[0,0,0,16383],[11,15,12,15],[11,16,12,16],[11,3,11,14],[11,17,11,28],[4,4,4,15],[4,17,4,28]]}
["Aquaculture - Marron Crayfish Production financial analysis"]
[]
[null,"Pond"]
[null,"LABOUR:"]
[null,null,null,null,"YEAR 1",null,null,null,null,null,null,null,null,null,null,null,1,"YEAR 2",null,null,null,null,null,null,null,null,null,null,null,null,2,null,3,null,4,null,5,null,6,null,7,null,8,null,9]
[null,"Employees:","Year 1","Annual Cost: Year 1","Month 1","Month 2","Month 3","Month 4","Month 5","Month 6","Month 7","Month 8","Month 9","Month 10","Month 11","Month 12","Year 2:","Month 1","Month 2","Month 3","Month 4","Month 5","Month 6","Month 7","Month 8","Month 9","Month 10","Month 11","Month 12","Annual Cost: Year 2","Year 3:","Annual Cost: Year 3","Year 4:","Annual Cost: Year 4","Year 5","Annual Cost: Year 5","Year 6","Annual Cost: Year 6","Year 7","Annual Cost: Year 7","Year 8","Annual Cost: Year 8","Year 9","Annual Cost: Year 9","Year 10","Annual Cost: Year 10"]
{"$rows_left_out":12}
{"sheet":"CAPEX","index":9,"n_rows":39,"n_cols":10,"rows_kept":39,"cut":false,"hidden":false,"merged":[[2,2,2,9],[0,0,0,16383]]}
["Aquaculture - Marron Crayfish Production financial analysis"]
[]
[null,null,"Pond"]
[null,null,"Item","Units","Number of units","RATIOS or capacity per month","Price per Unit (R)","TONS","TOTAL","TOTAL: WITH Increases in tonnage"]
[null,null,"1. Infrastructure",null,null,null,null,null,null,{"$f":"SUM(J6:J10)","v":{"$error":"#VALUE!"}}]
[null,null,"StoreRooms (m²)",{"$f":"IF(Interface!$J$7<10,(3*5),(5*5))","v":25},1,{"$f":"IF(Interface!$J$7<10,1,1.01)","v":1.01},{"$f":"'Built-In Assumptions'!E23","v":4850},{"$f":"Interface!$J$7","v":"<Please Select Tonnage>"},{"$f":"G6*D6*F6","v":122462.5},{"$f":"IF(Interface!$E$15=\"EXISTING\",0,I6)","v":122462.5}]
{"$rows_left_out":34}
{"sheet":"OPEX - Pond","index":10,"n_rows":41,"n_cols":49,"rows_kept":41,"cut":false,"hidden":false,"merged":[[0,0,0,16383],[2,2,3,2],[2,3,2,14],[2,15,3,15],[2,16,2,27],[2,28,3,28],[2,29,2,40],[2,47,3,47],[2,41,3,41],[2,42,3,42],[2,43,3,43],[2,44,3,44],[2,45,3,45],[2,46,3,46]]}
["Aquaculture - Marron Crayfish Production financial analysis"]
[null,null,null,null,null,null,null,null,null,null,null,null,null,null,null,1,null,null,null,null,null,null,null,null,null,null,null,1,2,null,null,null,null,null,null,null,null,null,null,null,2,3,4,5,6,7,8,9]
[null,null,"YEAR 1",{"$f":"C3","v":"YEAR 1"},null,null,null,null,null,null,null,null,null,null,null,"YEAR 2","Year 2",null,null,null,null,null,null,null,null,null,null,null,"YEAR 3","Year 3",null,null,null,null,null,null,null,null,null,null,null,"YEAR 4","YEAR 5","YEAR 6","YEAR 7","YEAR 8","YEAR 9","YEAR 10"]
[null,null,null,"Month 1","Month 2","Month 3","Month 4","Month 5","Month 6","Month 7","Month 8","Month 9","Month 10","Month 11","Month 12",null,"Month 1","Month 2","Month 3","Month 4","Month 5","Month 6","Month 7","Month 8","Month 9","Month 10","Month 11","Month 12",null,"Month 1","Month 2","Month 3","Month 4","Month 5","Month 6","Month 7","Month 8","Month 9","Month 10","Month 11","Month 12"]
[null,"Income from Sales:"]
[null,"Marron (Live, Fresh, frozen)",{"$f":"SUM(D6:O6)","v":0},0,0,0,0,0,0,0,0,0,0,0,0,{"$f":"SUM(Q6:AB6)","v":{"$error":"#VALUE!"}},0,0,0,0,0,0,0,0,0,{"$f":"AB6","v":{"$error":"#VALUE!"}},{"$f":"AB6","v":{"$error":"#VALUE!"}},{"$f":"(('Production Cycle'!$Y$10*('Production Cycle'!$Y$7*'Production Assumptions'!$C$6))*Interface!$I$7)/3","v":{"$error":"#VALUE!"}},{"$f":"SUM(AD6:AO6)","v":{"$error":"#VALUE!"}},{"$f":"Q6","v":0},{"$f":"R6","v":0},0,0,0,0,0,0,0,{"$f":"Z6*'Production Assumptions'!$C$6","v":{"$error":"#VALUE!"}},{"$f":"AA6*'Production Assumptions'!$C$6","v":{"$error":"#VALUE!"}},{"$f":"$AB$6*'Production Assumptions'!$C$6","v":{"$error":"#VALUE!"}},{"$f":"($AC$6)*('Production Assumptions'!$C$6)","v":{"$error":"#VALUE!"}},{"$f":"($AC$6)*('Production Assumptions'!$C$6)^AQ2","v":{"$error":"#VALUE!"}},{"$f":"($AC$6)*('Production Assumptions'!$C$6)^AR2","v":{"$error":"#VALUE!"}},{"$f":"($AC$6)*('Production Assumptions'!$C$6)^AS2","v":{"$error":"#VALUE!"}},{"$f":"($AC$6)*('Production Assumptions'!$C$6)^AT2","v":{"$error":"#VALUE!"}},{"$f":"($AC$6)*('Production Assumptions'!$C$6)^AU2","v":{"$error":"#VALUE!"}},{"$f":"($AC$6)*('Production Assumptions'!$C$6)^AV2","v":{"$error":"#VALUE!"}},{"$f":"AV6/AU6","v":{"$error":"#VALUE!"}}]
{"$rows_left_out":36}
{"sheet":"Working Capital - Pond","index":11,"n_rows":39,"n_cols":27,"rows_kept":39,"cut":false,"hidden":false,"merged":[[34,1,34,2],[0,0,0,16383],[2,2,2,13],[2,14,2,25]]}
["Aquaculture - Marron Crayfish Production financial analysis"]
[]
[null,"WORKING CAPITAL","Year 1",null,null,null,null,null,null,null,null,null,null,null,"Year 2"]
[null,null,{"$f":"'OPEX - Pond'!D4","v":"Month 1"},{"$f":"'OPEX - Pond'!E4","v":"Month 2"},{"$f":"'OPEX - Pond'!F4","v":"Month 3"},{"$f":"'OPEX - Pond'!G4","v":"Month 4"},{"$f":"'OPEX - Pond'!H4","v":"Month 5"},{"$f":"'OPEX - Pond'!I4","v":"Month 6"},{"$f":"'OPEX - Pond'!J4","v":"Month 7"},{"$f":"'OPEX - Pond'!K4","v":"Month 8"},{"$f":"'OPEX - Pond'!L4","v":"Month 9"},{"$f":"'OPEX - Pond'!M4","v":"Month 10"},{"$f":"'OPEX - Pond'!N4","v":"Month 11"},{"$f":"'OPEX - Pond'!O4","v":"Month 12"},"Month 13","Month 14","Month 15","Month 16","Month 17","Month 18","Month 19","Month 20","Month 21","Month 22","Month 23","Month 24","Total"]
[null,"VARIABLE COSTS:"]
[null,{"$f":"'OPEX - Pond'!B10","v":"Fingerling"},{"$f":"'OPEX - Pond'!D10","v":{"$error":"#VALUE!"}},{"$f":"'OPEX - Pond'!E10","v":0},{"$f":"'OPEX - Pond'!F10","v":0},{"$f":"'OPEX - Pond'!G10","v":0},{"$f":"'OPEX - Pond'!H10","v":0},{"$f":"'OPEX - Pond'!I10","v":0},{"$f":"'OPEX - Pond'!J10","v":0},{"$f":"'OPEX - Pond'!K10","v":0},{"$f":"'OPEX - Pond'!L10","v":0},{"$f":"'OPEX - Pond'!M10","v":0},{"$f":"'OPEX - Pond'!N10","v":0},{"$f":"'OPEX - Pond'!O10","v":0},{"$f":"'OPEX - Pond'!Q10","v":{"$error":"#VALUE!"}},{"$f":"'OPEX - Pond'!R10","v":0},{"$f":"'OPEX - Pond'!S10","v":0},{"$f":"'OPEX - Pond'!T10","v":0},{"$f":"'OPEX - Pond'!U10","v":0},{"$f":"'OPEX - Pond'!V10","v":0},{"$f":"'OPEX - Pond'!W10","v":0},{"$f":"'OPEX - Pond'!X10","v":0},{"$f":"'OPEX - Pond'!Y10","v":0},{"$f":"'OPEX - Pond'!Z10","v":0},{"$f":"'OPEX - Pond'!AA10","v":0},{"$f":"'OPEX - Pond'!AB10","v":0},{"$f":"SUM(C6:Z6)","v":{"$error":"#VALUE!"}}]
{"$rows_left_out":34}
{"sheet":"IS - Pond","index":12,"n_rows":56,"n_cols":14,"rows_kept":56,"cut":false,"hidden":false,"merged":[[2,3,2,12]]}
["Aquaculture - Marron Crayfish Production financial analysis"]
[]
[null,"Projected Income Statement",null,"Year"]
[null,null,"YEAR 0","Year 1","Year 2","Year 3","Year 4","Year 5","Year 6","Year 7","Year 8","Year 9","Year 10","NO POSITIVE"]
[null,"Revenue"]
[null,{"$f":"'OPEX - Pond'!B6","v":"Marron (Live, Fresh, frozen)"},null,{"$f":"'OPEX - Pond'!C6","v":0},{"$f":"'OPEX - Pond'!P6","v":{"$error":"#VALUE!"}},{"$f":"'OPEX - Pond'!AC6","v":{"$error":"#VALUE!"}},{"$f":"'OPEX - Pond'!AP6","v":{"$error":"#VALUE!"}},{"$f":"'OPEX - Pond'!AQ6","v":{"$error":"#VALUE!"}},{"$f":"'OPEX - Pond'!AR6","v":{"$error":"#VALUE!"}},{"$f":"'OPEX - Pond'!AS6","v":{"$error":"#VALUE!"}},{"$f":"'OPEX - Pond'!AT6","v":{"$error":"#VALUE!"}},{"$f":"'OPEX - Pond'!AU6","v":{"$error":"#VALUE!"}},{"$f":"'OPEX - Pond'!AV6","v":{"$error":"#VALUE!"}}]
{"$rows_left_out":51}
{"sheet":"BS - Pond","index":13,"n_rows":19,"n_cols":12,"rows_kept":19,"cut":false,"hidden":false,"merged":[[2,2,2,11],[0,0,0,16383]]}
["Aquaculture - Marron Crayfish Production financial analysis"]
[]
[null,"Projected Balance Sheet","Year"]
[null,null,"YEAR 1","YEAR 2","YEAR 3","YEAR 4","YEAR 5","YEAR 6","YEAR 7","YEAR 8","YEAR 9","YEAR 10"]
[null,"Fixed Assets"]
[null,"Net Property, Plant & Equipment",{"$f":"CAPEX!J39+'IS - Pond'!D40","v":{"$error":"#VALUE!"}},{"$f":"C6+'IS - Pond'!E40","v":{"$error":"#VALUE!"}},{"$f":"D6+'IS - Pond'!F40","v":{"$error":"#VALUE!"}},{"$f":"E6+'IS - Pond'!G40","v":{"$error":"#VALUE!"}},{"$f":"F6+'IS - Pond'!H40","v":{"$error":"#VALUE!"}},{"$f":"G6+'IS - Pond'!I40","v":{"$error":"#VALUE!"}},{"$f":"H6+'IS - Pond'!J40","v":{"$error":"#VALUE!"}},{"$f":"I6+'IS - Pond'!K40","v":{"$error":"#VALUE!"}},{"$f":"J6+'IS - Pond'!L40","v":{"$error":"#VALUE!"}},{"$f":"K6+'IS - Pond'!M40","v":{"$error":"#VALUE!"}}]
{"$rows_left_out":14}
{"sheet":"CF - Pond","index":14,"n_rows":37,"n_cols":14,"rows_kept":37,"cut":false,"hidden":false,"merged":[[2,3,2,12],[0,0,0,16383]]}
["Aquaculture - Marron Crayfish Production financial analysis"]
[]
[null,"Projected Cash Flow Statement",null,"Year"]
[null,null,null,"Year 1","Year 2","Year 3","Year 4","Year 5","Year 6","Year 7","Year 8","Year 9","Year 10","NO POSITIVE"]
[null,"Cash flows from operating activities"]
[null,"Profit / (Loss) for the year",null,{"$f":"'IS - Pond'!D47","v":{"$error":"#VALUE!"}},{"$f":"'IS - Pond'!E47","v":{"$error":"#VALUE!"}},{"$f":"'IS - Pond'!F47","v":{"$error":"#VALUE!"}},{"$f":"'IS - Pond'!G47","v":{"$error":"#VALUE!"}},{"$f":"'IS - Pond'!H47","v":{"$error":"#VALUE!"}},{"$f":"'IS - Pond'!I47","v":{"$error":"#VALUE!"}},{"$f":"'IS - Pond'!J47","v":{"$error":"#VALUE!"}},{"$f":"'IS - Pond'!K47","v":{"$error":"#VALUE!"}},{"$f":"'IS - Pond'!L47","v":{"$error":"#VALUE!"}},{"$f":"'IS - Pond'!M47","v":{"$error":"#VALUE!"}}]
{"$rows_left_out":32}
{"sheet":"IRR - Pond","index":15,"n_rows":20,"n_cols":4,"rows_kept":20,"cut":false,"hidden":false,"merged":[[3,2,3,3],[0,0,0,16383]]}
["Aquaculture - Marron Crayfish Production financial analysis"]
[]
[]
[null,null,"IRR CALCULATION"]
[null,null,"Period","Nett cash Flow for period"]
[null,null,"Initial Investment",{"$f":"-('BS - Pond'!C14+'Loan - Pond'!B10)","v":0}]
{"$rows_left_out":15}
{"sheet":"NPV & PI - Pond","index":16,"n_rows":20,"n_cols":10,"rows_kept":20,"cut":false,"hidden":false,"merged":[[3,2,3,3],[0,0,0,16383]]}
["Aquaculture - Marron Crayfish Production financial analysis"]
[]
[]
[null,null,"NPV & PI Index"]
[null,null,"Period","Nett cash Flow for period","Discounted Cash Flow"]
[null,null,"Initial Investment",{"$f":"'IRR - Pond'!D6","v":0}]
{"$rows_left_out":15}
{"sheet":"DEP - Pond","index":17,"n_rows":28,"n_cols":15,"rows_kept":28,"cut":false,"hidden":false,"merged":[[2,5,2,14],[0,0,0,16383],[2,2,3,2],[2,3,3,3],[2,4,3,4]]}
["Aquaculture - Marron Crayfish Production financial analysis"]
[]
[null,"Item","Useful Lifetime in Years","Rate","Price","Year"]
[null,null,null,null,null,1,{"$f":"F4+1","v":2},{"$f":"G4+1","v":3},4,5,6,7,8,9,10]
[null,"Infrastructure"]
[null,{"$f":"CAPEX!C6","v":"StoreRooms (m²)"},50,{"$f":"100%/C6","v":0.02},{"$f":"CAPEX!J6","v":122462.5},{"$f":"E6*D6","v":2449.25},{"$f":"IF(G4<=$C$6,F6,0)","v":2449.25},2449.25,2449.25,2449.25,2449.25,2449.25,2449.25,2449.25,2449.25]
{"$rows_left_out":23}
{"sheet":"Loan - Pond","index":18,"n_rows":256,"n_cols":8,"rows_kept":256,"cut":false,"hidden":true,"merged":[[8,0,8,1],[0,0,0,16383]]}
["Aquaculture - Marron Crayfish Production financial analysis"]
[]
["Year 1 loan"]
["Balance:",{"$f":"B10","v":0}]
["Interest rate:",{"$f":"B11/12","v":0}]
["Periods:",12]
{"$rows_left_out":251}
{"sheet":"Loan Int & Bal - Pond","index":19,"n_rows":6,"n_cols":21,"rows_kept":6,"cut":false,"hidden":true,"merged":[[0,0,0,16383]]}
["Aquaculture - Marron Crayfish Production financial analysis"]
[]
[null,"Year 1","Year 2","Year 3","Year 4","Year 5","Year 6","Year 7","Year 8","Year 9","Year 10","Year 11","Year 12","Year 13","Year 14","Year 15","Year 16","Year 17","Year 18","Year 19","Year 20"]
["Annual Interest",{"$f":"SUM('Loan - Pond'!E17:E28)","v":{"$error":"#VALUE!"}},{"$f":"SUM('Loan - Pond'!E29:E40)","v":{"$error":"#VALUE!"}},{"$f":"SUM('Loan - Pond'!E41:E52)","v":{"$error":"#VALUE!"}},{"$f":"SUM('Loan - Pond'!E53:E64)","v":{"$error":"#VALUE!"}},{"$f":"SUM('Loan - Pond'!E65:E76)","v":{"$error":"#VALUE!"}},{"$f":"SUM('Loan - Pond'!E77:E88)","v":{"$error":"#VALUE!"}},{"$f":"SUM('Loan - Pond'!E89:E100)","v":{"$error":"#VALUE!"}},{"$f":"SUM('Loan - Pond'!E101:E112)","v":{"$error":"#VALUE!"}},{"$f":"SUM('Loan - Pond'!E113:E124)","v":{"$error":"#VALUE!"}},{"$f":"SUM('Loan - Pond'!E125:E136)","v":{"$error":"#VALUE!"}},{"$f":"SUM('Loan - Pond'!E137:E148)","v":{"$error":"#VALUE!"}},{"$f":"SUM('Loan - Pond'!E149:E160)","v":{"$error":"#VALUE!"}},{"$f":"SUM('Loan - Pond'!E161:E172)","v":{"$error":"#VALUE!"}},{"$f":"SUM('Loan - Pond'!E173:E184)","v":{"$error":"#VALUE!"}},{"$f":"SUM('Loan - Pond'!E185:E196)","v":{"$error":"#VALUE!"}},{"$f":"SUM('Loan - Pond'!E197:E208)","v":{"$error":"#VALUE!"}},{"$f":"SUM('Loan - Pond'!E209:E220)","v":{"$error":"#VALUE!"}},{"$f":"SUM('Loan - Pond'!E221:E232)","v":{"$error":"#VALUE!"}},{"$f":"SUM('Loan - Pond'!E233:E244)","v":{"$error":"#VALUE!"}},{"$f":"SUM('Loan - Pond'!E245:E256)","v":{"$error":"#VALUE!"}}]
["Annual Balance",{"$f":"'Loan - Pond'!H28","v":{"$error":"#VALUE!"}},{"$f":"'Loan - Pond'!H40","v":{"$error":"#VALUE!"}},{"$f":"'Loan - Pond'!H52","v":{"$error":"#VALUE!"}},{"$f":"'Loan - Pond'!H64","v":{"$error":"#VALUE!"}},{"$f":"'Loan - Pond'!H76","v":{"$error":"#VALUE!"}},{"$f":"'Loan - Pond'!H88","v":{"$error":"#VALUE!"}},{"$f":"'Loan - Pond'!H100","v":{"$error":"#VALUE!"}},{"$f":"'Loan - Pond'!H112","v":{"$error":"#VALUE!"}},{"$f":"'Loan - Pond'!H124","v":{"$error":"#VALUE!"}},{"$f":"'Loan - Pond'!H136","v":{"$error":"#VALUE!"}},{"$f":"'Loan - Pond'!H148","v":{"$error":"#VALUE!"}},{"$f":"'Loan - Pond'!H160","v":{"$error":"#VALUE!"}},{"$f":"'Loan - Pond'!H172","v":{"$error":"#VALUE!"}},{"$f":"'Loan - Pond'!H184","v":{"$error":"#VALUE!"}},{"$f":"'Loan - Pond'!H196","v":{"$error":"#VALUE!"}},{"$f":"'Loan - Pond'!H208","v":{"$error":"#VALUE!"}},{"$f":"'Loan - Pond'!H220","v":{"$error":"#VALUE!"}},{"$f":"'Loan - Pond'!H232","v":{"$error":"#VALUE!"}},{"$f":"'Loan - Pond'!H244","v":{"$error":"#VALUE!"}},{"$f":"'Loan - Pond'!H256","v":{"$error":"#VALUE!"}}]
["Repayments",{"$f":"'Loan - Pond'!$B$14*12","v":{"$error":"#VALUE!"}},{"$f":"'Loan - Pond'!$B$14*12","v":{"$error":"#VALUE!"}},{"$f":"'Loan - Pond'!$B$14*12","v":{"$error":"#VALUE!"}},{"$f":"'Loan - Pond'!$B$14*12","v":{"$error":"#VALUE!"}},{"$f":"'Loan - Pond'!$B$14*12","v":{"$error":"#VALUE!"}},{"$f":"'Loan - Pond'!$B$14*12","v":{"$error":"#VALUE!"}},{"$f":"'Loan - Pond'!$B$14*12","v":{"$error":"#VALUE!"}},{"$f":"'Loan - Pond'!$B$14*12","v":{"$error":"#VALUE!"}},{"$f":"'Loan - Pond'!$B$14*12","v":{"$error":"#VALUE!"}},{"$f":"'Loan - Pond'!$B$14*12","v":{"$error":"#VALUE!"}},{"$f":"'Loan - Pond'!$B$14*12","v":{"$error":"#VALUE!"}},{"$f":"'Loan - Pond'!$B$14*12","v":{"$error":"#VALUE!"}},{"$f":"'Loan - Pond'!$B$14*12","v":{"$error":"#VALUE!"}},{"$f":"'Loan - Pond'!$B$14*12","v":{"$error":"#VALUE!"}},{"$f":"'Loan - Pond'!$B$14*12","v":{"$error":"#VALUE!"}},{"$f":"'Loan - Pond'!$B$14*12","v":{"$error":"#VALUE!"}},{"$f":"'Loan - Pond'!$B$14*12","v":{"$error":"#VALUE!"}},{"$f":"'Loan - Pond'!$B$14*12","v":{"$error":"#VALUE!"}},{"$f":"'Loan - Pond'!$B$14*12","v":{"$error":"#VALUE!"}},{"$f":"'Loan - Pond'!$B$14*12","v":{"$error":"#VALUE!"}}]
{"$rows_left_out":1}
{"sheet":"BREAK-EVEN GRAPH","index":20,"n_rows":5,"n_cols":6,"rows_kept":5,"cut":false,"hidden":true,"merged":[[1,5,1,6]]}
[]
[null,null,null,null,null,{"$f":" Interface!$J$8&\" - \"&Interface!$J$7","v":"Tonnage per production cycle - <Please Select Tonnage>"}]
[null,"BREAK EVEN POINT"]
[null,"Minimum Tonnage required to breakeven",{"$f":"'OPEX - Pond'!C37/(Interface!I7*1000)","v":{"$error":"#VALUE!"}}]
[null,"Break-even point (Rands)",{"$f":"C4*(Interface!I7*1000)","v":{"$error":"#VALUE!"}}]

{"sheet":"RISK","index":21,"n_rows":35,"n_cols":9,"rows_kept":35,"cut":false,"hidden":true,"merged":[[1,1,2,3]]}
[]
[null,"RISK FACTORS"]
[]
[]
[null,"PRIME INTEREST",0.10249999999999999]
[null,"CURRENT PRODUCTION FACTOR",1]
{"$rows_left_out":29}