{"text_format":"1","workbook":"xlsx","n_sheets":21,"sheets":["Using the Model","Interface","Built-In Assumptions","Validation","Production Assumptions","Technical info","Feed and Biomass","Bio-Model","CAPEX ","HR","OPEX - RAS","Working Capital - RAS","IS - RAS","BS - RAS","CF - RAS","IRR - RAS","NPV & PI - RAS","DEP - RAS","Loan - RAS","Loan Int & Bal - RAS","RISK"],"not_rendered":{"charts":0,"images":20,"macros":1,"external_links":1,"defined_names":2,"comments":1,"pivot_tables":0},"unopened":[],"bounds":{"document_bytes":16777216,"sheet_cells":100000,"rows_first":2000,"rows_last":500,"rows_between":2000,"halvings":0,"cell_chars":16384,"cell_head_chars":4096},"cells_cut":0,"cells_raw":0,"read":"whole","date_system":"1900"}

{"sheet":"Using the Model","index":0,"n_rows":74,"n_cols":3,"rows_kept":74,"cut":false,"hidden":false,"merged":[]}
[]
[]
[]
[]
[]
[]
{"$rows_left_out":69}
{"sheet":"Interface","index":1,"n_rows":47,"n_cols":10,"rows_kept":47,"cut":false,"hidden":false,"merged":[[46,5,47,8],[7,6,9,6],[29,4,29,5],[8,8,9,8],[28,4,28,5],[39,7,40,7],[34,5,35,5],[34,8,35,8],[39,5,40,5],[39,6,40,6],[34,6,35,6],[18,5,18,6],[34,7,35,7],[7,4,8,4],[42,6,42,7],[43,6,44,7],[7,5,8,5]]}
[null,"Economic Analysis Model For the R&D aquaculture projects"]
[]
[]
[]
[]
[]
{"$rows_left_out":42}
{"sheet":"Built-In Assumptions","index":2,"n_rows":23,"n_cols":8,"rows_kept":23,"cut":false,"hidden":false,"merged":[[3,3,3,4],[19,3,19,4]]}
[null,"Built-In Assumptions"]
[]
[]
[null,null,null,"GENERAL ASSUMPTIONS"]
[null,null,null,"CPI",5.0999999999999997E-2]
[null,null,null,"Business Tax",0.28000000000000003]
{"$rows_left_out":18}
{"sheet":"Validation","index":3,"n_rows":120,"n_cols":8,"rows_kept":120,"cut":false,"hidden":true,"merged":[]}
[null,"NUMBER OF FISH",null,"Species",null,"Systems",null,"Markets"]
[null,"<Please Select Number of Fish>",null,"<Please Select a Species>",null,"<Please Select a System>",null,"<Please Select a Market>"]
[null,15000,null,"Marine Ornamental ",null," Recirculation Aquaculture System (RAS)",null,"Local Markets"]
[null,16000,null,null,null,"Aquaponics",null,"International Markets"]
[null,17000,null,null,null,"Pond culture"]
[null,18000,null,null,null,"Flow-Through "]
{"$rows_left_out":115}
{"sheet":"Production Assumptions","index":4,"n_rows":75,"n_cols":12,"rows_kept":75,"cut":false,"hidden":false,"merged":[[2,1,2,2],[40,1,40,2],[0,0,0,16383]]}
["PRODUCTION ASSUMPTIONS - MARINE ORNAMENTALS MODEL"]
[]
[null,"GENERAL ASSUMPTIONS",null,null,null,"Tonnages","Permits","Price"]
[null,"CPI",{"$f":"'Built-In Assumptions'!E5","v":5.0999999999999997E-2},null,null,"15 year aquaculture right. Annual permit to undertake marine aquaculture. Annual permit to operate a marine hatchery.  \n",null,4500]
[null,"Days per month",30]
[null," CPI in percentage",{"$f":"C4+1","v":1.0509999999999999},null,null,"Feed & Stocking",null,"FEED AVERAGE"]
{"$rows_left_out":70}
{"sheet":"Technical info","index":5,"n_rows":55,"n_cols":12,"rows_kept":55,"cut":false,"hidden":false,"merged":[[24,1,24,3],[24,5,24,6]]}
[]
[null,"MARINE ORNAMENTALS"]
[null,"Production Per Tunnel",null,null,null,null,null,null,null,"Electricity Usage"]
[null,null,null,null,"Volume",null,null,null,null,"Electricity Per tank (kWh/day)",1.3]
[null,"Number of Ponds",{"$f":"72","v":72},null,1200,null,null,null,null,"Electricity Per tank (kWh/month)",{"$f":"K4*30","v":39}]
[null,"Breeding Tanks",50,null,null,null,null,null,null,"Total Electricity Breeding Tanks/month",{"$f":"C6*K5","v":1950}]
{"$rows_left_out":50}
{"sheet":"Feed and Biomass","index":6,"n_rows":19,"n_cols":7,"rows_kept":19,"cut":false,"hidden":false,"merged":[[0,0,0,16383]]}
["FEED REQUIREMENTS - MARINE ORNAMENTALS MODEL"]
[]
[null,null,null,null,"Pond Size",null,{"$f":"'Technical info'!E5","v":1200}]
[null,null,"BIOMASS CALCULATIONS",null,"Number fish/pond",null,{"$f":"'Technical info'!C15","v":300}]
[null,null,"Fish per pond",{"$f":"'Technical info'!C15","v":300},"Number of ponds",null,{"$f":"'Technical info'!K17","v":{"$error":"#VALUE!"}}]
[null,null,"Final Mass fish (g)",10]
{"$rows_left_out":14}
{"sheet":"Bio-Model","index":7,"n_rows":19,"n_cols":15,"rows_kept":19,"cut":false,"hidden":true,"merged":[[0,0,0,16383]]}
["BIO-MODEL - MARINE ORNAMENTALS MODEL"]
[]
["Biofilter"]
["Hungary model"]
[null,"Portion of system"]
["Solids settlement",{"$f":"100/3","v":33.333333333333336}]
{"$rows_left_out":14}
{"sheet":"CAPEX ","index":8,"n_rows":31,"n_cols":14,"rows_kept":31,"cut":false,"hidden":false,"merged":[[2,1,2,9],[0,0,0,16383]]}
["CAPITAL EXPENDITURE - FRESHWATER ORNAMENTALS MODEL"]
[]
[null,"RAS - CAPEX TO ESTABLISH ONE TUNNEL & NECESSARY INFRASTRUCTURE"]
[null,"Item","Units","Capacity (tanks per month)","Number of units","RATIO","Price per Unit (R)","Number of Fish","TOTAL","TOTAL: WITH Increases in numbers",null,"Pumps"]
[null,"1. Infrastructure",null,null,null,null,null,null,null,{"$f":"SUM(J6:J9)","v":{"$error":"#VALUE!"}},null,"no pumps (2 pumps per tunnel)",2,{"$f":"E7*M5","v":{"$error":"#VALUE!"}}]
[null,"Hatchery Room",{"$f":"IF(Interface!J7<=25000,6*8,IF(Interface!J7<=35000,8*8,9*8))","v":72},null,1,1,1200,{"$f":"Interface!$J$7","v":"<Please Select Number of Fish>"},{"$f":"C6*G6","v":86400},{"$f":"IF(Interface!E15=\"EXISTING\",0,I6)","v":86400},null,"Pump Cost",null,1200]
{"$rows_left_out":26}
{"sheet":"HR","index":9,"n_rows":21,"n_cols":46,"rows_kept":21,"cut":false,"hidden":true,"merged":[[10,36,11,36],[10,29,11,29],[10,30,11,30],[0,0,0,16383],[2,1,2,45],[10,31,11,31],[10,32,11,32],[10,33,11,33],[10,34,11,34],[10,35,11,35],[17,1,17,9],[4,4,4,15],[4,17,4,28],[10,3,10,14],[10,17,10,28],[10,15,11,15],[10,16,11,16]]}
["HUMAN RESOURCES - FRESHWATER ORNAMENTALS MODEL"]
[]
[null,"RAS"]
[null,"LABOUR:"]
[null,null,null,null,"YEAR 1",null,null,null,null,null,null,null,null,null,null,null,1,"YEAR 2",null,null,null,null,null,null,null,null,null,null,null,null,2,null,3,null,4,null,5,null,6,null,7,null,8,null,9]
[null,"Employees:","Year 1","Annual Cost: Year 1","Month 1","Month 2","Month 3","Month 4","Month 5","Month 6","Month 7","Month 8","Month 9","Month 10","Month 11","Month 12","Year 2:","Month 1","Month 2","Month 3","Month 4","Month 5","Month 6","Month 7","Month 8","Month 9","Month 10","Month 11","Month 12","Annual Cost: Year 2","Year 3:","Annual Cost: Year 3","Year 4:","Annual Cost: Year 4","Year 5","Annual Cost: Year 5","Year 6","Annual Cost: Year 6","Year 7","Annual Cost: Year 7","Year 8","Annual Cost: Year 8","Year 9","Annual Cost: Year 9","Year 10","Annual Cost: Year 10"]
{"$rows_left_out":16}
{"sheet":"OPEX - RAS","index":10,"n_rows":37,"n_cols":36,"rows_kept":37,"cut":false,"hidden":false,"merged":[[0,0,0,16383],[2,35,3,35],[2,29,3,29],[2,30,3,30],[2,31,3,31],[2,32,3,32],[2,33,3,33],[2,34,3,34],[2,2,3,2],[2,3,2,14],[2,15,3,15],[2,16,2,27],[2,28,3,28]]}
["OPERATIONAL EXPENDITURE - RAS"]
[null,null,null,null,null,null,null,null,null,null,null,null,null,null,null,1,null,null,null,null,null,null,null,null,null,null,null,1,2,3,4,5,6,7,8,9]
[null,null,"YEAR 1",{"$f":"C3","v":"YEAR 1"},null,null,null,null,null,null,null,null,null,null,null,"YEAR 2","Year 2",null,null,null,null,null,null,null,null,null,null,null,"YEAR 3","YEAR 4","YEAR 5","YEAR 6","YEAR 7","YEAR 8","YEAR 9","YEAR 10"]
[null,null,null,"Month 1","Month 2","Month 3","Month 4","Month 5","Month 6","Month 7","Month 8","Month 9","Month 10","Month 11","Month 12",null,"Month 1","Month 2","Month 3","Month 4","Month 5","Month 6","Month 7","Month 8","Month 9","Month 10","Month 11","Month 12"]
[null,"Income from Sales:"]
[null,"Marine Ornamentals (Selling stock)",{"$f":"SUM(D6:O6)","v":{"$error":"#VALUE!"}},{"$f":"IF(Interface!$E$18=Validation!D39,(Interface!$I$7*'Feed and Biomass'!#REF!),0)","v":0},{"$f":"IF(Interface!$E$18=Validation!D39,D6,IF(Interface!$E$18=Validation!D40,Interface!$I$7*'Feed and Biomass'!#REF!,0))","v":0},{"$f":"IF(Interface!$E$18=Validation!D39,D6,IF(Interface!$E$18=Validation!D40,E6,IF(Interface!$E$18=Validation!D41,Interface!$I$7*'Feed and Biomass'!#REF!,0)))","v":0},{"$f":"IF(Interface!$E$18=Validation!D39,D6,IF(Interface!$E$18=Validation!D40,E6,IF(Interface!$E$18=Validation!D41,F6,IF(Interface!$E$18=Validation!D42,Interface!$I$7*'Feed and Biomass'!#REF!,0))))","v":0},{"$f":"IF(Interface!$E$18=Validation!D39,D6,IF(Interface!$E$18=Validation!D40,E6,IF(Interface!$E$18=Validation!D41,F6,IF(Interface!$E$18=Validation!D42,G6,IF(Interface!$E$18=Validation!D43,Interface!$I$7*'Feed and Biomass'!#REF!,0)))))","v":0},{"$f":"Interface!J10*Interface!I7","v":{"$error":"#VALUE!"}},{"$f":"I6","v":{"$error":"#VALUE!"}},{"$f":"J6","v":{"$error":"#VALUE!"}},{"$error":"#VALUE!"},{"$error":"#VALUE!"},{"$error":"#VALUE!"},{"$error":"#VALUE!"},{"$f":"SUM(Q6:AB6)","v":{"$error":"#VALUE!"}},{"$f":"O6*'Production Assumptions'!$C$6","v":{"$error":"#VALUE!"}},{"$f":"Q6","v":{"$error":"#VALUE!"}},{"$f":"R6","v":{"$error":"#VALUE!"}},{"$f":"S6","v":{"$error":"#VALUE!"}},{"$f":"T6","v":{"$error":"#VALUE!"}},{"$error":"#VALUE!"},{"$error":"#VALUE!"},{"$error":"#VALUE!"},{"$error":"#VALUE!"},{"$error":"#VALUE!"},{"$error":"#VALUE!"},{"$error":"#VALUE!"},{"$f":"($AB$6*'Production Assumptions'!$C$6)*12","v":{"$error":"#VALUE!"}},{"$f":"($AB$6*12)*('Production Assumptions'!$C$6)^AC2","v":{"$error":"#VALUE!"}},{"$f":"($AB$6*12)*('Production Assumptions'!$C$6)^AD2","v":{"$error":"#VALUE!"}},{"$f":"($AB$6*12)*('Production Assumptions'!$C$6)^AE2","v":{"$error":"#VALUE!"}},{"$f":"($AB$6*12)*('Production Assumptions'!$C$6)^AF2","v":{"$error":"#VALUE!"}},{"$f":"($AB$6*12)*('Production Assumptions'!$C$6)^AG2","v":{"$error":"#VALUE!"}},{"$f":"($AB$6*12)*('Production Assumptions'!$C$6)^AH2","v":{"$error":"#VALUE!"}},{"$f":"($AB$6*12)*('Production Assumptions'!$C$6)^AI2","v":{"$error":"#VALUE!"}}]
{"$rows_left_out":32}
{"sheet":"Working Capital - RAS","index":11,"n_rows":34,"n_cols":9,"rows_kept":34,"cut":false,"hidden":false,"merged":[[29,1,29,2],[0,0,0,25],[2,1,3,1]]}
["WORKING CAPITAL - RAS "]
[]
[null,"WORKING CAPITAL"]
[null,null,"Month 1","Month 2","Month 3","Month 4","Month 5","Month 6","TOTAL"]
[null,"VARIABLE COSTS:"]
[null,{"$f":"'OPEX - RAS'!B10","v":"Breeding Fish"},{"$f":"'OPEX - RAS'!D10","v":20000},{"$f":"'OPEX - RAS'!E10","v":0},{"$f":"'OPEX - RAS'!F10","v":0},{"$f":"'OPEX - RAS'!G10","v":0},{"$f":"'OPEX - RAS'!H10","v":0},{"$f":"'OPEX - RAS'!I10","v":0},{"$f":"IF(Interface!$E$18=Validation!$D$39,C6,IF(Interface!$E$18=Validation!$D$40,SUM(C6:D6),IF(Interface!$E$18=Validation!$D$41,SUM(C6:E6),IF(Interface!$E$18=Validation!$D$42,SUM(C6:F6),IF(Interface!$E$18=Validation!$D$43,SUM(C6:G6),IF(Interface!$E$18=Validation!$D$44,SUM(C6:H6),IF(Interface!$E$18=Validation!$D$45,SUM(C6:H6),IF(Interface!$E$18=Validation!$D$46,SUM(C6:H6),IF(Interface!$E$18=Validation!$D$47,SUM(C6:H6),)))))))))","v":20000}]
{"$rows_left_out":29}
{"sheet":"IS - RAS","index":12,"n_rows":48,"n_cols":14,"rows_kept":48,"cut":false,"hidden":false,"merged":[[0,0,0,16383],[2,1,3,1],[2,2,2,12]]}
["INCOME STATEMENT - RAS"]
[]
[null,"Projected Income Statement","Year"]
[null,null,"YEAR 0","YEAR 1","YEAR 2","YEAR 3","YEAR 4","YEAR 5","YEAR 6","YEAR 7","YEAR 8","YEAR 9","YEAR 10","NO POSITIVE"]
[null,"Revenue"]
[null,{"$f":"'OPEX - RAS'!B6","v":"Marine Ornamentals (Selling stock)"},null,{"$f":"'OPEX - RAS'!C7","v":{"$error":"#VALUE!"}},{"$f":"'OPEX - RAS'!P7","v":{"$error":"#VALUE!"}},{"$f":"'OPEX - RAS'!AC7","v":{"$error":"#VALUE!"}},{"$f":"'OPEX - RAS'!AD7","v":{"$error":"#VALUE!"}},{"$f":"'OPEX - RAS'!AE7","v":{"$error":"#VALUE!"}},{"$f":"'OPEX - RAS'!AF7","v":{"$error":"#VALUE!"}},{"$f":"'OPEX - RAS'!AG7","v":{"$error":"#VALUE!"}},{"$f":"'OPEX - RAS'!AH7","v":{"$error":"#VALUE!"}},{"$f":"'OPEX - RAS'!AI7","v":{"$error":"#VALUE!"}},{"$f":"'OPEX - RAS'!AJ7","v":{"$error":"#VALUE!"}}]
{"$rows_left_out":43}
{"sheet":"BS - RAS","index":13,"n_rows":18,"n_cols":11,"rows_kept":18,"cut":false,"hidden":false,"merged":[]}
[]
["Projected Balance Sheet","Year"]
[null,"YEAR 1","YEAR 2","YEAR 3","YEAR 4","YEAR 5","YEAR 6","YEAR 7","YEAR 8","YEAR 9","YEAR 10"]
["Fixed Assets"]
["Net Property, Plant & Equipment",{"$f":"'CAPEX '!J31+'IS - RAS'!D38","v":{"$error":"#VALUE!"}},{"$f":"(B5+'IS - RAS'!E38)","v":{"$error":"#VALUE!"}},{"$f":"(C5+'IS - RAS'!F38)","v":{"$error":"#VALUE!"}},{"$f":"(D5+'IS - RAS'!G38)","v":{"$error":"#VALUE!"}},{"$f":"(E5+'IS - RAS'!H38)","v":{"$error":"#VALUE!"}},{"$f":"(F5+'IS - RAS'!I38)","v":{"$error":"#VALUE!"}},{"$f":"(G5+'IS - RAS'!J38)","v":{"$error":"#VALUE!"}},{"$f":"(H5+'IS - RAS'!K38)","v":{"$error":"#VALUE!"}},{"$f":"(I5+'IS - RAS'!L38)","v":{"$error":"#VALUE!"}},{"$f":"(J5+'IS - RAS'!M38)","v":{"$error":"#VALUE!"}}]
["Current Assets"]
{"$rows_left_out":13}
{"sheet":"CF - RAS","index":14,"n_rows":35,"n_cols":13,"rows_kept":35,"cut":false,"hidden":false,"merged":[[0,2,0,11]]}
["Projected Cash Flow Statement",null,"Year"]
[null,null,"Year 1","Year 2","Year 3","Year 4","Year 5","Year 6","Year 7","Year 8","Year 9","Year 10","NO POSITIVE"]
["Cash flows from operating activities"]
["Profit / (Loss) for the year",null,{"$f":"'IS - RAS'!D45","v":{"$error":"#VALUE!"}},{"$f":"'IS - RAS'!E45","v":{"$error":"#VALUE!"}},{"$f":"'IS - RAS'!F45","v":{"$error":"#VALUE!"}},{"$f":"'IS - RAS'!G45","v":{"$error":"#VALUE!"}},{"$f":"'IS - RAS'!H45","v":{"$error":"#VALUE!"}},{"$f":"'IS - RAS'!I45","v":{"$error":"#VALUE!"}},{"$f":"'IS - RAS'!J45","v":{"$error":"#VALUE!"}},{"$f":"'IS - RAS'!K45","v":{"$error":"#VALUE!"}},{"$f":"'IS - RAS'!L45","v":{"$error":"#VALUE!"}},{"$f":"'IS - RAS'!M45","v":{"$error":"#VALUE!"}}]
["Taxation",null,{"$f":"-'IS - RAS'!D43","v":{"$error":"#VALUE!"}},{"$f":"-'IS - RAS'!E43","v":{"$error":"#VALUE!"}},{"$f":"-'IS - RAS'!F43","v":{"$error":"#VALUE!"}},{"$f":"-'IS - RAS'!G43","v":{"$error":"#VALUE!"}},{"$f":"-'IS - RAS'!H43","v":{"$error":"#VALUE!"}},{"$f":"-'IS - RAS'!I43","v":{"$error":"#VALUE!"}},{"$f":"-'IS - RAS'!J43","v":{"$error":"#VALUE!"}},{"$f":"-'IS - RAS'!K43","v":{"$error":"#VALUE!"}},{"$f":"-'IS - RAS'!L43","v":{"$error":"#VALUE!"}},{"$f":"-'IS - RAS'!M43","v":{"$error":"#VALUE!"}}]
["Adjustment for non-cash expenses:"]
{"$rows_left_out":30}
{"sheet":"IRR - RAS","index":15,"n_rows":19,"n_cols":4,"rows_kept":19,"cut":false,"hidden":false,"merged":[[2,2,2,3]]}
[]
[]
[null,null,"IRR CALCULATION"]
[null,null,"Period","Nett cash Flow for period"]
[null,null,"Initial Investment",{"$f":"-('BS - RAS'!B13+'Loan - RAS'!B9)","v":0}]
[null,null,1,{"$f":"'CF - RAS'!C33","v":{"$error":"#VALUE!"}}]
{"$rows_left_out":14}
{"sheet":"NPV & PI - RAS","index":16,"n_rows":19,"n_cols":10,"rows_kept":19,"cut":false,"hidden":false,"merged":[[2,2,2,3]]}
[]
[null,null,null,"2016 REPO Rate",7.0000000000000007E-2]
[null,null,"NPV & PI Index"]
[null,null,"Period","Nett cash Flow for period","Discounted Cash Flow"]
[null,null,"Initial Investment",{"$f":"'IRR - RAS'!D5","v":0}]
[null,null,1,{"$f":"'IRR - RAS'!D6","v":{"$error":"#VALUE!"}},{"$f":"D6/((1+$E$2)^C6)","v":{"$error":"#VALUE!"}}]
{"$rows_left_out":14}
{"sheet":"DEP - RAS","index":17,"n_rows":27,"n_cols":15,"rows_kept":27,"cut":false,"hidden":false,"merged":[[2,5,2,14]]}
[]
[]
[null,"Item","Useful Lifetime in Years","Rate","Price","Year"]
[null,null,null,null,null,1,{"$f":"F4+1","v":2},{"$f":"G4+1","v":3},4,5,6,7,8,9,10]
[null,"Infrastructure"]
[null,{"$f":"'CAPEX '!B6","v":"Hatchery Room"},50,{"$f":"100%/C6","v":0.02},{"$f":"'CAPEX '!J6","v":86400},{"$f":"E6*D6","v":1728},{"$f":"IF(G$4<=$C6,F6,0)","v":1728},{"$f":"IF(H$4<=$C6,G6,0)","v":1728},1728,1728,1728,1728,1728,1728,1728]
{"$rows_left_out":22}
{"sheet":"Loan - RAS","index":18,"n_rows":255,"n_cols":8,"rows_kept":255,"cut":false,"hidden":true,"merged":[[7,0,7,1]]}
[]
["Year 1 loan"]
["Balance:",{"$f":"B9","v":0}]
["Interest rate:",{"$f":"B10/12","v":0}]
["Periods:",12]
["Monthly Payment:",{"$f":"PMT(B4,B5,-B3)","v":0}]
{"$rows_left_out":250}
{"sheet":"Loan Int & Bal - RAS","index":19,"n_rows":5,"n_cols":21,"rows_kept":5,"cut":false,"hidden":true,"merged":[]}
[]
[null,"Year 1","Year 2","Year 3","Year 4","Year 5","Year 6","Year 7","Year 8","Year 9","Year 10","Year 11","Year 12","Year 13","Year 14","Year 15","Year 16","Year 17","Year 18","Year 19","Year 20"]
["Annual Interest",{"$f":"SUM('Loan - RAS'!E16:E27)","v":{"$error":"#VALUE!"}},{"$f":"SUM('Loan - RAS'!E28:E39)","v":{"$error":"#VALUE!"}},{"$f":"SUM('Loan - RAS'!E40:E51)","v":{"$error":"#VALUE!"}},{"$f":"SUM('Loan - RAS'!E52:E63)","v":{"$error":"#VALUE!"}},{"$f":"SUM('Loan - RAS'!E64:E75)","v":{"$error":"#VALUE!"}},{"$f":"SUM('Loan - RAS'!E76:E87)","v":{"$error":"#VALUE!"}},{"$f":"SUM('Loan - RAS'!E88:E99)","v":{"$error":"#VALUE!"}},{"$f":"SUM('Loan - RAS'!E100:E111)","v":{"$error":"#VALUE!"}},{"$f":"SUM('Loan - RAS'!E112:E123)","v":{"$error":"#VALUE!"}},{"$f":"SUM('Loan - RAS'!E124:E135)","v":{"$error":"#VALUE!"}},{"$f":"SUM('Loan - RAS'!E136:E147)","v":{"$error":"#VALUE!"}},{"$f":"SUM('Loan - RAS'!E148:E159)","v":{"$error":"#VALUE!"}},{"$f":"SUM('Loan - RAS'!E160:E171)","v":{"$error":"#VALUE!"}},{"$f":"SUM('Loan - RAS'!E172:E183)","v":{"$error":"#VALUE!"}},{"$f":"SUM('Loan - RAS'!E184:E195)","v":{"$error":"#VALUE!"}},{"$f":"SUM('Loan - RAS'!E196:E207)","v":{"$error":"#VALUE!"}},{"$f":"SUM('Loan - RAS'!E208:E219)","v":{"$error":"#VALUE!"}},{"$f":"SUM('Loan - RAS'!E220:E231)","v":{"$error":"#VALUE!"}},{"$f":"SUM('Loan - RAS'!E232:E243)","v":{"$error":"#VALUE!"}},{"$f":"SUM('Loan - RAS'!E244:E255)","v":{"$error":"#VALUE!"}}]
["Annual Balance",{"$f":"'Loan - RAS'!H27","v":{"$error":"#VALUE!"}},{"$f":"'Loan - RAS'!H39","v":{"$error":"#VALUE!"}},{"$f":"'Loan - RAS'!H51","v":{"$error":"#VALUE!"}},{"$f":"'Loan - RAS'!H63","v":{"$error":"#VALUE!"}},{"$f":"'Loan - RAS'!H75","v":{"$error":"#VALUE!"}},{"$f":"'Loan - RAS'!H87","v":{"$error":"#VALUE!"}},{"$f":"'Loan - RAS'!H99","v":{"$error":"#VALUE!"}},{"$f":"'Loan - RAS'!H111","v":{"$error":"#VALUE!"}},{"$f":"'Loan - RAS'!H123","v":{"$error":"#VALUE!"}},{"$f":"'Loan - RAS'!H135","v":{"$error":"#VALUE!"}},{"$f":"'Loan - RAS'!H147","v":{"$error":"#VALUE!"}},{"$f":"'Loan - RAS'!H159","v":{"$error":"#VALUE!"}},{"$f":"'Loan - RAS'!H171","v":{"$error":"#VALUE!"}},{"$f":"'Loan - RAS'!H183","v":{"$error":"#VALUE!"}},{"$f":"'Loan - RAS'!H195","v":{"$error":"#VALUE!"}},{"$f":"'Loan - RAS'!H207","v":{"$error":"#VALUE!"}},{"$f":"'Loan - RAS'!H219","v":{"$error":"#VALUE!"}},{"$f":"'Loan - RAS'!H231","v":{"$error":"#VALUE!"}},{"$f":"'Loan - RAS'!H243","v":{"$error":"#VALUE!"}},{"$f":"'Loan - RAS'!H255","v":{"$error":"#VALUE!"}}]
["Repayments",{"$f":"'Loan - RAS'!$B$13*12","v":{"$error":"#VALUE!"}},{"$f":"'Loan - RAS'!$B$13*12","v":{"$error":"#VALUE!"}},{"$f":"'Loan - RAS'!$B$13*12","v":{"$error":"#VALUE!"}},{"$f":"'Loan - RAS'!$B$13*12","v":{"$error":"#VALUE!"}},{"$f":"'Loan - RAS'!$B$13*12","v":{"$error":"#VALUE!"}},{"$f":"'Loan - RAS'!$B$13*12","v":{"$error":"#VALUE!"}},{"$f":"'Loan - RAS'!$B$13*12","v":{"$error":"#VALUE!"}},{"$f":"'Loan - RAS'!$B$13*12","v":{"$error":"#VALUE!"}},{"$f":"'Loan - RAS'!$B$13*12","v":{"$error":"#VALUE!"}},{"$f":"'Loan - RAS'!$B$13*12","v":{"$error":"#VALUE!"}},{"$f":"'Loan - RAS'!$B$13*12","v":{"$error":"#VALUE!"}},{"$f":"'Loan - RAS'!$B$13*12","v":{"$error":"#VALUE!"}},{"$f":"'Loan - RAS'!$B$13*12","v":{"$error":"#VALUE!"}},{"$f":"'Loan - RAS'!$B$13*12","v":{"$error":"#VALUE!"}},{"$f":"'Loan - RAS'!$B$13*12","v":{"$error":"#VALUE!"}},{"$f":"'Loan - RAS'!$B$13*12","v":{"$error":"#VALUE!"}},{"$f":"'Loan - RAS'!$B$13*12","v":{"$error":"#VALUE!"}},{"$f":"'Loan - RAS'!$B$13*12","v":{"$error":"#VALUE!"}},{"$f":"'Loan - RAS'!$B$13*12","v":{"$error":"#VALUE!"}},{"$f":"'Loan - RAS'!$B$13*12","v":{"$error":"#VALUE!"}}]

{"sheet":"RISK","index":20,"n_rows":35,"n_cols":9,"rows_kept":35,"cut":false,"hidden":true,"merged":[[1,1,2,3]]}
[]
[null,"RISK FACTORS"]
[]
[]
[null,"PRIME INTEREST",0.10249999999999999]
[null,"CURRENT PRODUCTION FACTOR",1]
{"$rows_left_out":29}